reppmic

Members
  • Posts

    25
  • Joined

  • Last visited

Everything posted by reppmic

  1. Hi, need help 🙂 i unfortunately deleted a folder with rm-rf /Folder/ in Terminal is there a way to recovery/restore my stuff with using the unraid Shell / Docker or VM without an additional drive? the disk was max 10% filled before i dropped my command in Terminal The disk is XFS formatted please help 🙂
  2. yes, i hopefully wait for a fix, i have no time and fun to setup all new inside my VM
  3. whole day trying around, i think there is an error with VPN/NIC and OR boot order
  4. yes, your right, my Big Sur IMG stopped at 2.15GB
  5. i cant even install a new one, when i start the new VM vnc is not working for me
  6. Hi, since the last unRaid 6.11.2 update my MacinaBox Catalina has stopped working. i have nothing changed für months on my VM because its only needed to do some automation stuff has anyone a good idea to help me out? <?xml version='1.0' encoding='UTF-8'?> <domain type='kvm' xmlns:qemu='http://libvirt.org/schemas/domain/qemu/1.0'> <name>MacinaboxCatalina</name> <uuid>c3f054-6db2-4d60-96d9-64dfe19ec57d</uuid> <description>MacOS Catalina</description> <metadata> <vmtemplate xmlns="unraid" name="Windows 10" icon="default.png" os="Catalina"/> </metadata> <memory unit='KiB'>8388608</memory> <currentMemory unit='KiB'>8388608</currentMemory> <memoryBacking> <nosharepages/> </memoryBacking> <vcpu placement='static'>4</vcpu> <cputune> <vcpupin vcpu='0' cpuset='1'/> <vcpupin vcpu='1' cpuset='5'/> <vcpupin vcpu='2' cpuset='2'/> <vcpupin vcpu='3' cpuset='6'/> </cputune> <resource> <partition>/machine</partition> </resource> <os> <type arch='x86_64' machine='pc-q35-3.1'>hvm</type> <loader readonly='yes' type='pflash'>/usr/share/qemu/ovmf-x64/OVMF_CODE-pure-efi.fd</loader> <nvram>/etc/libvirt/qemu/nvram/c39df054-6db2-4d60-96d9-64dfe19ec57d_VARS-pure-efi.fd</nvram> <boot dev='fd'/> </os> <features> <acpi/> <apic/> </features> <cpu mode='host-passthrough' check='none' migratable='on'> <topology sockets='1' dies='1' cores='2' threads='2'/> <cache mode='passthrough'/> </cpu> <clock offset='utc'> <timer name='rtc' tickpolicy='catchup'/> <timer name='pit' tickpolicy='delay'/> <timer name='hpet' present='no'/> </clock> <on_poweroff>destroy</on_poweroff> <on_reboot>restart</on_reboot> <on_crash>restart</on_crash> <devices> <emulator>/usr/local/sbin/qemu</emulator> <disk type='file' device='disk'> <driver name='qemu' type='qcow2' cache='writeback'/> <source file='/mnt/user/domains/MacinaboxCatalina/Clover.qcow2'/> <target dev='hdc' bus='sata'/> <address type='drive' controller='0' bus='0' target='0' unit='2'/> </disk> <disk type='file' device='disk'> <driver name='qemu' type='raw' cache='writeback'/> <source file='/mnt/user/domains/MacinaboxCatalina/Catalina-install.img'/> <target dev='hdd' bus='sata'/> <address type='drive' controller='0' bus='0' target='0' unit='3'/> </disk> <disk type='file' device='disk'> <driver name='qemu' type='raw' cache='writeback'/> <source file='/mnt/user/domains/MacinaboxCatalina/macos_disk.img'/> <target dev='hde' bus='sata'/> <address type='drive' controller='0' bus='0' target='0' unit='4'/> </disk> <controller type='pci' index='0' model='pcie-root'/> <controller type='pci' index='1' model='pcie-root-port'> <model name='pcie-root-port'/> <target chassis='1' port='0x10'/> <address type='pci' domain='0x0000' bus='0x00' slot='0x02' function='0x0' multifunction='on'/> </controller> <controller type='pci' index='2' model='pcie-root-port'> <model name='pcie-root-port'/> <target chassis='2' port='0x11'/> <address type='pci' domain='0x0000' bus='0x00' slot='0x02' function='0x1'/> </controller> <controller type='pci' index='3' model='pcie-root-port'> <model name='pcie-root-port'/> <target chassis='3' port='0x12'/> <address type='pci' domain='0x0000' bus='0x00' slot='0x02' function='0x2'/> </controller> <controller type='pci' index='4' model='pcie-root-port'> <model name='pcie-root-port'/> <target chassis='4' port='0x13'/> <address type='pci' domain='0x0000' bus='0x00' slot='0x02' function='0x3'/> </controller> <controller type='virtio-serial' index='0'> <address type='pci' domain='0x0000' bus='0x02' slot='0x00' function='0x0'/> </controller> <controller type='sata' index='0'> <address type='pci' domain='0x0000' bus='0x00' slot='0x1f' function='0x2'/> </controller> <controller type='usb' index='0' model='nec-xhci' ports='15'> <address type='pci' domain='0x0000' bus='0x00' slot='0x07' function='0x0'/> </controller> <interface type='bridge'> <mac address='52:54:00:18:a6:18'/> <source bridge='br0'/> <model type='virtio-net'/> <address type='pci' domain='0x0000' bus='0x01' slot='0x00' function='0x0'/> </interface> <serial type='pty'> <target type='isa-serial' port='0'> <model name='isa-serial'/> </target> </serial> <console type='pty'> <target type='serial' port='0'/> </console> <channel type='unix'> <target type='virtio' name='org.qemu.guest_agent.0'/> <address type='virtio-serial' controller='0' bus='0' port='1'/> </channel> <input type='tablet' bus='usb'> <address type='usb' bus='0' port='1'/> </input> <input type='mouse' bus='ps2'/> <input type='keyboard' bus='ps2'/> <graphics type='vnc' port='-1' autoport='yes' websocket='-1' listen='0.0.0.0' keymap='de'> <listen type='address' address='0.0.0.0'/> </graphics> <audio id='1' type='none'/> <video> <model type='qxl' ram='65536' vram='65536' vgamem='16384' heads='1' primary='yes'/> <address type='pci' domain='0x0000' bus='0x00' slot='0x01' function='0x0'/> </video> <memballoon model='virtio'> <address type='pci' domain='0x0000' bus='0x03' slot='0x00' function='0x0'/> </memballoon> </devices> <seclabel type='dynamic' model='dac' relabel='yes'/> <qemu:commandline> <qemu:arg value='-usb'/> <qemu:arg value='-device'/> <qemu:arg value='usb-kbd,bus=usb-bus.0'/> <qemu:arg value='-device'/> <qemu:arg value='************************'/> <qemu:arg value='-smbios'/> <qemu:arg value='type=2'/> <qemu:arg value='-cpu'/> <qemu:arg value='Penryn,kvm=on,vendor=GenuineIntel,+invtsc,vmware-cpuid-freq=on,+pcid,+ssse3,+sse4.2,+popcnt,+avx,+aes,+xsave,+xsaveopt,check'/> </qemu:commandline> </domain>
  7. no, i tried to install it via GUI of unraid this is not possible?
  8. Hi, i tired to install some plugins which i missed now like libmediainfo. i go to slackware and choosed the link under Slackware current...... https://slackware.pkgs.org/current/slackers/libmediainfo-22.06-x86_64-2cf.txz.html when i use this link to install i get the following error : plugin: installing: libmediainfo-22.06-x86_64-2cf.txz plugin: downloading: libmediainfo-22.06-x86_64-2cf.txz ... 100% plugin: downloading: libmediainfo-22.06-x86_64-2cf.txz ... done Executing hook script: pre_plugin_checks plugin: XML file doesn't exist or xml parse error Executing hook script: post_plugin_checks what went wrong? Thanks for any Help
  9. Hi, is there any chance to get any of these resolutions in Big Sur or Catalina? : 1024x768, 1280x960, 1440 x1080, 1600x1200 ?
  10. ahh ok, though docker version has another changelog then the one from github thanks
  11. Hi, bin ziemlicher unRaid Neuling - eben kam eine „update iobroker“ Meldung , wo kann ich sehen was dieses update beinhaltet (changelog)? VG
  12. mhhh, but when i use openVPN or IPsec it has the normal behaviour. when port is closed or VPN server is offline the VPN did not start.
  13. Sorry for double-post ... i posted it in dynamix wireguard topic but maybe somebody has an explanation here : Hi, i installed wireguard this week , all works fine but i noticed one thing: even when i deactivate Wireguard or/and the open UDP Port on my router iOS „established“ a VPN connection (which is not working) but it shows „connected“ and the VPN Sign is in the upper right corner. any ideas why? greetings
  14. Hi, i installed wireguard this week , all works fine but i noticed one thing: even when i deactivate Wireguard or/and the open UDP Port on my router iOS „established“ a VPN connection (which is not working) but it shows „connected“ and the VPN Sign is in the upper right corner. any ideas why? greetings
  15. ok thanks for this info with emhttp daemon. but why is the chmod 777 /dev/bus/usb/001/003 command not working? must take a look in the user scripts plug-in , thanks for this hint
  16. Hi, i need help with my go file : #!/bin/bash # Start the Management Utility chmod 777 /dev/bus/usb/001/003 cp /mnt/disk8/isos/prename.pl /usr/bin chmod 777 /usr/bin/prename.pl modprobe i915 chown -R nobody:users /dev/dri chmod -R 777 /dev/dri /usr/local/sbin/emhttp & bash_profile () { if [ -f /root/.bash_profile ]; then cat /boot/config/mybashprofile >> /root/.bash_profile fi } # Update Bash Profile bash_profile its working 50%, this commands are not executed after boot : chmod 777 /dev/bus/usb/001/003 cp /mnt/disk8/isos/prename.pl /usr/bin chmod 777 /usr/bin/prename.pl i dont know why - these commands are working 100% when i execute them in a shell after reboot help would be great
  17. ok, thanks for clearify , but is it also not possible to setup unraid Wireguard that the incoming client can only access a specific ip range?
  18. is it possible to activate the VPN only when trying to access specific dns names oder ip adresses? scenario : on the road , logged into 5G , no VPN -> open my SecurityCam app which points to 192.x.x.x , VPN will start and shutdown when app is closed (or specific idle time) or connect only when i try to connect to a specific ip range would be great
  19. after : apt-get update && apt-get install libpcap-dev i was able to install and start the adapter , it „listens“ only when i start iobroker in „host“ mode , i think there is a broadcast address or port which must be opened. i have something similar in Tvheadend : Host vs. Bridge If you use IPTV, SAT>IP or HDHomeRun, you need to create the container with --net=host and remove the -p flags. This is because to work with these services Tvheadend requires a multicast address of 239.255.255.250 and a UDP port of 1900 which at this time is not possible with docker bridge mode. If you have other host services which also use multicast such as SSDP/DLNA/Emby you may experience stabilty problems. These can be solved by giving tvheadend its own IP using macavlan. is there a significant disadvantage when i start iobroker in host mode? (bridge is more isolated, but is there another thing) when i restart iobroker i must again run apt-get update &&...... is there another way around this? Thanks!
  20. Hello, Thanks for creating this container. i migrated from a raspberry pi4 to my unraid machine - so far i can see all adapters are working except of one: i cant install amazon.dash button adapter , see log - seems that some pcap stuff is missing, any ideas? Dankeschön $ ./iobroker add amazon-dash --host 4ce650a5a078 NPM version: 6.14.10 npm install iobroker.amazon-dash@1.1.0 --loglevel error --unsafe-perm --prefix "/opt/iobroker" (System call) WARNING: apt does not have a stable CLI interface. Use with caution in scripts. E: Sperrdatei /var/lib/dpkg/lock-frontend konnte nicht geöffnet werden. - open (13: Keine Berechtigung)E: Unable to acquire the dpkg frontend lock (/var/lib/dpkg/lock-frontend), are you root? ../authenticate_pam.cc: In function ‘void after_doing_auth(uv_work_t*, int)’:../authenticate_pam.cc:107:87: warning: ‘v8::Local<v8::Value> Nan::MakeCallback(v8::Local<v8::Object>, v8::Local<v8::Function>, int, v8::Local<v8::Value>*)’ is deprecated [-Wdeprecated-declarations] Nan::MakeCallback(Nan::GetCurrentContext()->Global(), Nan::New(m->callback), 1, args); ^In file included from ../authenticate_pam.cc:23:../../nan/nan.h:1026:46: note: declared here NAN_DEPRECATED inline v8::Local<v8::Value> MakeCallback( ^~~~~~~~~~~~../authenticate_pam.cc:107:87: warning: ‘v8::Local<v8::Value> Nan::MakeCallback(v8::Local<v8::Object>, v8::Local<v8::Function>, int, v8::Local<v8::Value>*)’ is deprecated [-Wdeprecated-declarations] Nan::MakeCallback(Nan::GetCurrentContext()->Global(), Nan::New(m->callback), 1, args); ^In file included from ../authenticate_pam.cc:23:../../nan/nan.h:1026:46: note: declared here NAN_DEPRECATED inline v8::Local<v8::Value> MakeCallback( ^~~~~~~~~~~~ ../authenticate_pam.cc: In function ‘Nan::NAN_METHOD_RETURN_TYPE Authenticate(Nan::NAN_METHOD_ARGS_TYPE)’:../authenticate_pam.cc:147:83: warning: ‘v8::Local<v8::Value> v8::Object::Get(v8::Local<v8::Value>)’ is deprecated: Use maybe version [-Wdeprecated-declarations] Local<Value> res = options->Get(Nan::New<String>("serviceName").ToLocalChecked()); ^ In file included from /opt/iobroker/.cache/node-gyp/12.20.1/include/node/v8-internal.h:14, from /opt/iobroker/.cache/node-gyp/12.20.1/include/node/v8.h:27, from /opt/iobroker/.cache/node-gyp/12.20.1/include/node/node.h:67, from ../../nan/nan.h:56, from ../authenticate_pam.cc:23:/opt/iobroker/.cache/node-gyp/12.20.1/include/node/v8.h:3553:51: note: declared here V8_DEPRECATED("Use maybe version", Local<Value> Get(Local<Value> key)); ^~~/opt/iobroker/.cache/node-gyp/12.20.1/include/node/v8config.h:328:3: note: in definition of macro ‘V8_DEPRECATED’ declarator __attribute__((deprecated(message))) ^~~~~~~~~~../authenticate_pam.cc:150:69: error: no matching function for call to ‘v8::String::WriteUtf8(char [128], long unsigned int)’ serviceName->WriteUtf8(m->serviceName, sizeof(m->serviceName) - 1); ^ In file included from /opt/iobroker/.cache/node-gyp/12.20.1/include/node/node.h:67, from ../../nan/nan.h:56, from ../authenticate_pam.cc:23:/opt/iobroker/.cache/node-gyp/12.20.1/include/node/v8.h:2878:7: note: candidate: ‘int v8::String::WriteUtf8(v8::Isolate*, char*, int, int*, int) const’ int WriteUtf8(Isolate* isolate, char* buffer, int length = -1, ^~~~~~~~~/opt/iobroker/.cache/node-gyp/12.20.1/include/node/v8.h:2878:7: note: no known conversion for argument 1 from ‘char [128]’ to ‘v8::Isolate*’../authenticate_pam.cc:152:69: warning: ‘v8::Local<v8::Value> v8::Object::Get(v8::Local<v8::Value>)’ is deprecated: Use maybe version [-Wdeprecated-declarations] res = options->Get(Nan::New<String>("remoteHost").ToLocalChecked()); ^In file included from /opt/iobroker/.cache/node-gyp/12.20.1/include/node/v8-internal.h:14, from /opt/iobroker/.cache/node-gyp/12.20.1/include/node/v8.h:27, from /opt/iobroker/.cache/node-gyp/12.20.1/include/node/node.h:67, from ../../nan/nan.h:56, from ../authenticate_pam.cc:23:/opt/iobroker/.cache/node-gyp/12.20.1/include/node/v8.h:3553:51: note: declared here V8_DEPRECATED("Use maybe version", Local<Value> Get(Local<Value> key)); ^~~/opt/iobroker/.cache/node-gyp/12.20.1/include/node/v8config.h:328:3: note: in definition of macro ‘V8_DEPRECATED’ declarator __attribute__((deprecated(message))) ^~~~~~~~~~../authenticate_pam.cc:155:66: error: no matching function for call to ‘v8::String::WriteUtf8(char [128], long unsigned int)’ remoteHost->WriteUtf8(m->remoteHost, sizeof(m->remoteHost) - 1); ^In file included from /opt/iobroker/.cache/node-gyp/12.20.1/include/node/node.h:67, from ../../nan/nan.h:56, from ../authenticate_pam.cc:23:/opt/iobroker/.cache/node-gyp/12.20.1/include/node/v8.h:2878:7: note: candidate: ‘int v8::String::WriteUtf8(v8::Isolate*, char*, int, int*, int) const’ int WriteUtf8(Isolate* isolate, char* buffer, int length = -1, ^~~~~~~~~/opt/iobroker/.cache/node-gyp/12.20.1/include/node/v8.h:2878:7: note: no known conversion for argument 1 from ‘char [128]’ to ‘v8::Isolate*’../authenticate_pam.cc:160:58: error: no matching function for call to ‘v8::String::WriteUtf8(char [128], long unsigned int)’ username->WriteUtf8(m->username, sizeof(m->username) - 1); ^In file included from /opt/iobroker/.cache/node-gyp/12.20.1/include/node/node.h:67, from ../../nan/nan.h:56, from ../authenticate_pam.cc:23:/opt/iobroker/.cache/node-gyp/12.20.1/include/node/v8.h:2878:7: note: candidate: ‘int v8::String::WriteUtf8(v8::Isolate*, char*, int, int*, int) const’ int WriteUtf8(Isolate* isolate, char* buffer, int length = -1, ^~~~~~~~~/opt/iobroker/.cache/node-gyp/12.20.1/include/node/v8.h:2878:7: note: no known conversion for argument 1 from ‘char [128]’ to ‘v8::Isolate*’../authenticate_pam.cc:161:58: error: no matching function for call to ‘v8::String::WriteUtf8(char [128], long unsigned int)’ password->WriteUtf8(m->password, sizeof(m->password) - 1); ^In file included from /opt/iobroker/.cache/node-gyp/12.20.1/include/node/node.h:67, from ../../nan/nan.h:56, from ../authenticate_pam.cc:23:/opt/iobroker/.cache/node-gyp/12.20.1/include/node/v8.h:2878:7: note: candidate: ‘int v8::String::WriteUtf8(v8::Isolate*, char*, int, int*, int) const’ int WriteUtf8(Isolate* isolate, char* buffer, int length = -1, ^~~~~~~~~/opt/iobroker/.cache/node-gyp/12.20.1/include/node/v8.h:2878:7: note: no known conversion for argument 1 from ‘char [128]’ to ‘v8::Isolate*’ ../authenticate_pam.cc: At global scope:../authenticate_pam.cc:170:11: error: variable or field ‘init’ declared void void init(Handle<Object> exports) { ^~~~~~../authenticate_pam.cc:170:11: error: ‘Handle’ was not declared in this scope ../authenticate_pam.cc:170:11: note: suggested alternative: ‘rand_r’ void init(Handle<Object> exports) { ^~~~~~ rand_r ../authenticate_pam.cc:170:24: error: expected primary-expression before ‘>’ token void init(Handle<Object> exports) { ^../authenticate_pam.cc:170:26: error: ‘exports’ was not declared in this scope void init(Handle<Object> exports) { ^~~~~~~ In file included from ../../nan/nan.h:56, from ../authenticate_pam.cc:23:../authenticate_pam.cc:175:31: error: ‘init’ was not declared in this scope NODE_MODULE(authenticate_pam, init); ^~~~/opt/iobroker/.cache/node-gyp/12.20.1/include/node/node.h:737:36: note: in definition of macro ‘NODE_MODULE_X’ (node::addon_register_func) (regfunc), \ ^~~~~~~../authenticate_pam.cc:175:1: note: in expansion of macro ‘NODE_MODULE’ NODE_MODULE(authenticate_pam, init); ^~~~~~~~~~~ ../authenticate_pam.cc:175:31: note: suggested alternative: ‘int’ NODE_MODULE(authenticate_pam, init); ^~~~/opt/iobroker/.cache/node-gyp/12.20.1/include/node/node.h:737:36: note: in definition of macro ‘NODE_MODULE_X’ (node::addon_register_func) (regfunc), \ ^~~~~~~../authenticate_pam.cc:175:1: note: in expansion of macro ‘NODE_MODULE’ NODE_MODULE(authenticate_pam, init); ^~~~~~~~~~~ make: *** [authenticate_pam.target.mk:111: Release/obj.target/authenticate_pam/authenticate_pam.o] Fehler 1 gyp ERR! build error gyp ERR! stack Error: `make` failed with exit code: 2gyp ERR! stack at ChildProcess.onExit (/usr/lib/node_modules/npm/node_modules/node-gyp/lib/build.js:194:23)gyp ERR! stack at ChildProcess.emit (events.js:314:20)gyp ERR! stack at Process.ChildProcess._handle.onexit (internal/child_process.js:276:12) gyp ERR! System Linux 5.10.1-Unraidgyp ERR! command "/usr/bin/node" "/usr/lib/node_modules/npm/node_modules/node-gyp/bin/node-gyp.js" "rebuild"gyp ERR! cwd /opt/iobroker/node_modules/authenticate-pamgyp ERR! node -v v12.20.1gyp ERR! node-gyp -v v5.1.0 gyp ERR! not ok ../src/linux/BluetoothSerialPort.cc:18:14: error: variable or field ‘InitAll’ declared void void InitAll(Handle<Object> exports) { ^~~~~~../src/linux/BluetoothSerialPort.cc:18:14: error: ‘Handle’ was not declared in this scope ../src/linux/BluetoothSerialPort.cc:18:14: note: suggested alternative: ‘rand_r’ void InitAll(Handle<Object> exports) { ^~~~~~ rand_r../src/linux/BluetoothSerialPort.cc:18:27: error: expected primary-expression before ‘>’ token void InitAll(Handle<Object> exports) { ^../src/linux/BluetoothSerialPort.cc:18:29: error: ‘exports’ was not declared in this scope void InitAll(Handle<Object> exports) { ^~~~~~~ In file included from ../src/linux/BluetoothSerialPort.cc:12:../src/linux/BluetoothSerialPort.cc:23:34: error: ‘InitAll’ was not declared in this scope NODE_MODULE(BluetoothSerialPort, InitAll) ^~~~~~~/opt/iobroker/.cache/node-gyp/12.20.1/include/node/node.h:737:36: note: in definition of macro ‘NODE_MODULE_X’ (node::addon_register_func) (regfunc), \ ^~~~~~~../src/linux/BluetoothSerialPort.cc:23:1: note: in expansion of macro ‘NODE_MODULE’ NODE_MODULE(BluetoothSerialPort, InitAll) ^~~~~~~~~~~ make: *** [BluetoothSerialPort.target.mk:117: Release/obj.target/BluetoothSerialPort/src/linux/BluetoothSerialPort.o] Fehler 1 gyp ERR! build error gyp ERR! stack Error: `make` failed with exit code: 2gyp ERR! stack at ChildProcess.onExit (/usr/lib/node_modules/npm/node_modules/node-gyp/lib/build.js:194:23)gyp ERR! stack at ChildProcess.emit (events.js:314:20)gyp ERR! stack at Process.ChildProcess._handle.onexit (internal/child_process.js:276:12) gyp ERR! System Linux 5.10.1-Unraidgyp ERR! command "/usr/bin/node" "/usr/lib/node_modules/npm/node_modules/node-gyp/bin/node-gyp.js" "configure" "build"gyp ERR! cwd /opt/iobroker/node_modules/node-bluetoothgyp ERR! node -v v12.20.1gyp ERR! node-gyp -v v5.1.0gyp ERR! not ok ../pcap_binding.cc:2:10: fatal error: pcap/pcap.h: Datei oder Verzeichnis nicht gefunden #include <pcap/pcap.h> ^~~~~~~~~~~~~ compilation terminated. make: *** [pcap_binding.target.mk:112: Release/obj.target/pcap_binding/pcap_binding.o] Fehler 1gyp ERR! build error gyp ERR! stack Error: `make` failed with exit code: 2gyp ERR! stack at ChildProcess.onExit (/usr/lib/node_modules/npm/node_modules/node-gyp/lib/build.js:194:23)gyp ERR! stack at ChildProcess.emit (events.js:314:20)gyp ERR! stack at Process.ChildProcess._handle.onexit (internal/child_process.js:276:12) gyp ERR! System Linux 5.10.1-Unraidgyp ERR! command "/usr/bin/node" "/usr/lib/node_modules/npm/node_modules/node-gyp/bin/node-gyp.js" "rebuild"gyp ERR! cwd /opt/iobroker/node_modules/pcapgyp ERR! node -v v12.20.1gyp ERR! node-gyp -v v5.1.0gyp ERR! not ok npm ERR! code ELIFECYCLEnpm ERR! errno 1 npm ERR! pcap@3.1.0 install: `node-gyp rebuild`npm ERR! Exit status 1npm ERR! npm ERR! Failed at the pcap@3.1.0 install script.npm ERR! This is probably not a problem with npm. There is likely additional logging output above. npm ERR! A complete log of this run can be found in:npm ERR! /opt/iobroker/.npm/_logs/2021-01-18T12_46_24_490Z-debug.log ERROR: host.4ce650a5a078 Cannot install iobroker.amazon-dash@1.1.0: 1 ERROR: process exited with code 25